Home > C Compiler > C Compiler Cannot Create Executables Linux

C Compiler Cannot Create Executables Linux

Contents

Click Here to receive this Complete Guide absolutely free. Does every interesting photograph have a story to tell? If it is not in the man pages or the how-to's this is the place! no checking for g++... http://mediastartpage.com/c-compiler/c-compiler-cannot-create-executables-arm-linux-gcc.html

Is this is the reason for this failure. [root@localhost objdir]# uname -a Linux localhost.localdomain 2.6.25-14.fc9.i686 #1 SMP Thu May 1 06:28:41 EDT 2008 i686 i686 i386 GNU/Linux [root@localhost objdir]# pwd /opt/objdir Code: [email protected]:~/tmp/aMule-2.0.3$ ./configure checking build system type... How to use namedpipe as temporary file? share|improve this answer answered Jul 24 '14 at 17:57 user55518 add a comment| Your Answer draft saved draft discarded Sign up or log in Sign up using Google Sign up

C Compiler Cannot Create Executables Linux

i686-pc-mingw32 checking for a BSD-compatible install... /bin/install -c checking whether build environment is sane... Find the function given its Fourier series Why is this C++ code faster than my hand-written assembly for testing the Collatz conjecture? It was created by cpuminer configure 2.4.2, which was generated by GNU Autoconf 2.69. no checking for aCC...

Your error that the C compiler cannot produce executable is likely caused by not having a 32 bit toolchain present. We recommend upgrading to the latest Safari, Google Chrome, or Firefox. Run prelink -au && depmod -a. Checking For C Compiler Default Output File Name The time now is 01:06 AM.

By joining our community you will have the ability to post topics, receive our newsletter, use the advanced search, subscribe to threads and access many other special features. Configure: Error: C Compiler Cannot Create Executables Mac I realized that I have entered it incorrectly into Linker flags in KDevelopment project options. It was created by configure, which was generated by GNU Autoconf 2.67. configure:3436: $? = 0 configure:3425: gcc -v >&5 Using built-in specs.

What is the origin of the word "pilko"? Checking Whether The C Compiler Works... No Mac no checking for CC... gcc checking whether the C compiler works... There is NO warranty; not even for MERCHANTABILITY or FITNESS FOR A PARTICULAR PURPOSE.

Configure: Error: C Compiler Cannot Create Executables Mac

no configure: error: in `/home/mike/cpuminer-2.4.2': configure: error: C compiler cannot create executables my system is ubuntu 14.04 and the system details say the os is 32 bit. How to deal with a coworker that writes software to give him job security instead of solving problems? C Compiler Cannot Create Executables Linux no checking for cl.exe... Configure Error C Compiler Cannot Create Executables Ubuntu Is it still the first hit off Google for this error message.

i686-pc-linux-gnu checking for a BSD-compatible install... /usr/bin/install -c checking whether build environment is sane... http://mediastartpage.com/c-compiler/c-compiler-cannot-create-executables-aix.html Code: apt-get build-essential solved this issue for me. x86_64-unknown-linux-gnu checking host system type... AlucardZero View Public Profile View LQ Blog View Review Entries View HCL Entries Find More Posts by AlucardZero 08-10-2011, 08:33 AM #15 Boeta87 LQ Newbie Registered: Oct 2010 Posts: Configure: Error: C Compiler Cannot Create Executables Centos

Invocation command line was $ ./configure ## --------- ## ## Platform. ## ## --------- ## hostname = colt102d.fchst.usa.hp.com uname -m = ia64 uname -r = 2.6.18-274.el5 uname -s = Linux uname But I have this error: BUILD FAILED Inspect or clean up the working tree at /var/folders/fn/1kz6tqdd2b58vl6lggn7ks4r0000gn/T/ruby-build.20130901135911.4559 Results logged to /var/folders/fn/1kz6tqdd2b58vl6lggn7ks4r0000gn/T/ruby-build.20130901135911.4559.log Last 10 log lines: checking build system type... more stack exchange communities company blog Stack Exchange Inbox Reputation and Badges sign up log in tour help Tour Start here for a quick overview of the site Help Center Detailed navigate here mirex View Public Profile View LQ Blog View Review Entries View HCL Entries Find More Posts by mirex 05-05-2007, 01:08 AM #4 reverse Member Registered: Apr 2007 Distribution: Gentoo

more hot questions question feed about us tour help blog chat data legal privacy policy work here advertising info mobile contact us feedback Technology Life / Arts Culture / Recreation Science Install A 32 Bit Compiler Toolchain Ask Ubuntu works best with JavaScript enabled UbuntuCommunityAsk!DeveloperDesignDiscourseHardwareInsightsJujuShopMore ›AppsHelpForumLaunchpadMAASCanonical current community chat Ask Ubuntu Ask Ubuntu Meta your communities Sign up or log in to customize your list. I'd suggest reinstalling MinGW.

Both gcc and base-devel are installed.

Notices Welcome to LinuxQuestions.org, a friendly and active Linux Community. There were few solution given online like installing 'kernel-devel' package but it did not resolve issue. ia64-redhat-linux-ar checking for ia64-redhat-linux-lipo... Configure: Error: C Compiler Cannot Create Executables Centos 6 What did John Templeton mean when he said that the four most dangerous words in investing are: ‘this time it’s different'?

If it's a rhel5 box then install the gcc rpm. If that is not feasible, I will close the case with out any second thought. ia64-unknown-linux-gnu checking for a BSD compatible install... /usr/bin/install -c checking whether ln works... his comment is here Main Menu LQ Calendar LQ Rules LQ Sitemap Site FAQ View New Posts View Latest Posts Zero Reply Threads LQ Wiki Most Wanted Jeremy's Blog Report LQ Bug Syndicate Latest

share|improve this answer edited Mar 7 '14 at 17:20 answered Mar 7 '14 at 14:11 mr.spuratic 1,945811 gcc -dump-machine gcc: error: missing argument to ‘-march=’ gcc: fatal error: no share|improve this answer edited Sep 27 at 6:47 Tshilidzi 1,786719 answered Sep 27 at 1:08 user599717 11 add a comment| Your Answer draft saved draft discarded Sign up or log How can tilting a N64 cartridge cause such subtle glitches? share|improve this answer edited Sep 19 '13 at 12:55 answered Sep 19 '13 at 12:35 steeldriver 32.3k44477 9 Normally /usr/local/bin is ahead of /usr/bin in PATH for good reason: there's

There's something else interesting about the cc1 invocation: it specifies the option -iprefix E:\MinGWmingw32/4.8.1/. g++: error: missing argument to '-march=' configure:4417: $? = 0 configure:4406: g++ -v >&5 Using built-in specs. configure:4417: $? = 4 configure:4421: checking whether we are using the GNU C++ compiler configure:4440: g++ -c conftest.cpp >&5 g++: error: missing argument to '-march=' configure:4440: $? = 1 configure: failed Or should I install 32bit compiler toolchain for getting it work. –Vishal Jul 24 '14 at 18:53 Thanks.

At least for me it did. no reverse View Public Profile View LQ Blog View Review Entries View HCL Entries Find More Posts by reverse 05-05-2007, 02:47 AM #5 Nylex LQ Addict Registered: Jul Offline Pages: 1 Index »Creating & Modifying Packages »[SOLVED] configure: error: C compiler cannot create executables Board footer Jump to Newbie Corner Installation Kernel & Hardware Applications & Desktop Environments Laptop It was created by configure, which was generated by GNU Autoconf 2.69.

After a 10 minute compilation it ended with the below error. no checking for mawk... This is free software; see the source for copying conditions. Comment 11 chilaka 2012-01-28 07:18:25 UTC (In reply to comment #10) > You need to have follow the directorions for building a cross sysroot or have a > sysroot already built.

Teenage daughter refusing to go to school Add comments to a python script and make it a bilingual python/C++ “program” Why are password boxes always blanked out when other sensitive data

© Copyright 2017 mediastartpage.com. All rights reserved.