Home > C Compiler > C Compiler Cannot Create Executables Mac

C Compiler Cannot Create Executables Mac

Contents

Just re-created my ubuntu vm and it compiled fine. gnutar checking whether make supports nested variables... asked 2 years ago viewed 78144 times active 2 years ago Related 4error while compiling ffmpeg: gcc is unable to create an executable file3Linux cannot compile without GCC optimizations; implications?0C compiler no checking for aCC... this contact form

any idea? more stack exchange communities company blog Stack Exchange Inbox Reputation and Badges sign up log in tour help Tour Start here for a quick overview of the site Help Center Detailed Invocation command line was $ ./configure CFLAGS=-march=native -mtune=native ## --------- ## ## Platform. ## ## --------- ## hostname = saucy1 uname -m = x86_64 uname -r = 3.11.0-15-generic uname -s = any help would be great as the compiler fails on anytime I try to use it, not just with this install. https://bbs.archlinux.org/viewtopic.php?id=108615

C Compiler Cannot Create Executables Mac

I am trying to build Ruby from source as describe here: https://www.ruby-lang.org/en/installation/#building-from-source Here what i am getting: [email protected]:~/ruby-2.1.1$ ./configure checking build system type... no checking for c++... Print a letter Fibonacci Teenage daughter refusing to go to school My manager said I spend too much time on Stack Exchange.

x86_64-unknown-linux-gnu checking for gcc... It might be due to change on source too. Xlaits Linux - Newbie 10 10-27-2010 04:44 AM configure: error: C compiler cannot create executables 2handband Slackware 10 06-12-2010 10:36 AM configure: error: C compiler cannot create executables watashiwaotaku7 Linux - Install A 32 Bit Compiler Toolchain o checking whether we are using the GNU C compiler...

Join them; it only takes a minute: Sign up Here's how it works: Anybody can ask a question Anybody can answer The best answers are voted up and rise to the C Compiler Cannot Create Executables Linux Offline #15 2010-11-19 00:31:53 Allan is always right From: Brisbane, AU Registered: 2007-06-09 Posts: 10,453 Website Re: [SOLVED] C compiler cannot create executables checking you actual "echo $PATH" output would be You probably have to fix build_android.sh to fix paths to you r compiler because it can not find gcc "/home/administrator/AndroidNDK/toolchains/arm-linux-androideabi-4.4.3/prebuilt/linux-x86/bin/arm-linux-androideabi-gcc: No such file or directory" I can check this more precisely Am I interrupting my husband's parenting?

there are something like: export CC="${CROSS_COMPILE}gcc --sysroot=$PLATFORM" you need to fix your gcc path: export CC="${CROSS_COMPILE}gcc-4.4.3 --sysroot=$PLATFORM" probably NM,STRIP etc. C Compiler Cannot Create Executables Cross Compile Not only your compiler, but your entire system environment, seems to be broken. share|improve this answer edited Mar 13 at 9:02 Mostafa Ahangarha 1,40731027 answered Mar 13 at 7:07 JohnH 111 add a comment| Your Answer draft saved draft discarded Sign up or collect2: error: ld returned 1 exit status0gcc is unable to create an executable file, compiling ffmpeg as static binary Hot Network Questions What is the total sum of the cardinalities of

C Compiler Cannot Create Executables Linux

Further down we see: ac_cv_env_CFLAGS_set=set ac_cv_env_CFLAGS_value=-m32 This flag tells gcc to produce 32 bit objects. try here Singular cohomology and birational equivalence Find the function given its Fourier series How to deal with a coworker that writes software to give him job security instead of solving problems? C Compiler Cannot Create Executables Mac Note that registered members see fewer ads, and ContentLink is completely disabled once you log in. C Compiler Cannot Create Executables Ubuntu Not the answer you're looking for?

configure:3820: $? = 4 configure:3840: checking whether the C compiler works configure:3862: gcc -march=native -mtune=native conftest.c >&5 configure:3866: $? = 0 configure:3914: result: yes configure:3917: checking for C compiler default output weblink The users who voted to close gave this specific reason:"Questions must be relevant to professional system administration. This site is not affiliated with Linus Torvalds or The Open Group in any way. How can I prove its value? C Compiler Cannot Create Executables Centos

weibullguy View Public Profile View LQ Blog View Review Entries View HCL Entries Visit weibullguy's homepage! no checking for cxx... Invocation command line was $ ./configure --prefix=/home/joshua/.rvm/rubies/ruby-1.9.3-p448 --with-gcc=clang --disable-install-doc --enable-shared ## --------- ## ## Platform. ## ## --------- ## hostname = trisquel6 uname -m = i686 uname -r = 3.2.0-52-generic-pae uname navigate here gcc: error: missing argument to '-march=' COLLECT_GCC=gcc COLLECT_LTO_WRAPPER=/usr/lib/gcc/x86_64-linux-gnu/4.8/lto-wrapper Target: x86_64-linux-gnu Configured with: ../src/configure -v --with-pkgversion='Ubuntu/Linaro 4.8.1-10ubuntu9' --with-bugurl=file:///usr/share/doc/gcc-4.8/README.Bugs --enable-languages=c,c++,java,go,d,fortran,objc,obj-c++ --prefix=/usr --program-suffix=-4.8 --enable-shared --enable-linker-build-id --libexecdir=/usr/lib --without-included-gettext --enable-threads=posix --with-gxx-include-dir=/usr/include/c++/4.8 --libdir=/usr/lib --enable-nls --with-sysroot=/ --enable-clocale=gnu --enable-libstdcxx-debug

gcc: error: missing argument to ‘-march=’ COLLECT_GCC=gcc COLLECT_LTO_WRAPPER=/usr/lib/gcc/x86_64-linux-gnu/4.8/lto-wrapper Target: x86_64-linux-gnu Configured with: ../src/configure -v --with-pkgversion='Ubuntu/Linaro 4.8.1-10ubuntu9' --with-bugurl=file:///usr/share/doc/gcc-4.8/README.Bugs --enable-languages=c,c++,java,go,d,fortran,objc,obj-c++ --prefix=/usr --program-suffix=-4.8 --enable-shared --enable-linker-build-id --libexecdir=/usr/lib --without-included-gettext --enable-threads=posix --with-gxx-include-dir=/usr/include/c++/4.8 --libdir=/usr/lib --enable-nls --with-sysroot=/ --enable-clocale=gnu --enable-libstdcxx-debug Checking Whether The C Compiler Works... No Mac none needed checking for g++... Why are Squibs not notified by the Ministry of Magic One Very Odd Email How can ransomware know file types?

Further, if you have a fixed size for your /tmp folder, it could be messed up with not enough space left for successful compiling.

i686-pc-linux-gnu checking target system type... Send a Postcard! | Blog | PGP Key: F99FFE0FEAE999BD Offline #10 2010-11-18 23:50:00 colbert Member Registered: 2007-12-16 Posts: 809 Re: [SOLVED] C compiler cannot create executables http://pastebin.ca/1995928 Offline #11 2010-11-19 00:00:26 This is free software; see the source for copying conditions. Configure: Exit 77 gawk checking whether make sets $(MAKE)...

Do you have gcc installed? yes checking whether make supports nested variables... no checking build system type... his comment is here no configure: error: in `/home/vkuser/httpd-2.2.27/srclib/apr': configure: error: C compiler cannot create executables I have tried to search online but no luck.

no checking for xlC... Advisor professor asks for my dissertation research source-code Was there no tax before 1913 in the United States? If you haven't logged out the LFS user, just source the .bashrc file to reset the variable. 2 members found this post helpful. z o.o.

First Skills to Learn for Mountaineering Assigning a unique representation to equivalent circular queues Draw some mountain peaks Determine maximum frequency of input signal to make system LTI Why is this Clang works though. –David Corbin May 5 '14 at 14:06 add a comment| up vote 2 down vote I solved it by ln -s /usr/bin/gcc /usr/bin/gcc-apple-4.2 share|improve this answer answered Feb

© Copyright 2017 mediastartpage.com. All rights reserved.