Home > Cannot Access > Cannot Access Junit.framework.testcase

Cannot Access Junit.framework.testcase

In the left column select Java Build Path. This test suite demonstrates the basic functionality of the suite() method, which is what you add each of the test cases to the suite in. You should start off in the Eclipse install directory, otherwise search through the file system until you find the Eclipse install directory. How can I declare independence from the United States and start my own micro nation? his comment is here

On the first page of the wizard you can specify the "Target Runtime" and if you do not have one there is a button "New" on the same page. The acctest/spec/ folder will contain the specification HTML tables of your FIT acceptance tests, while acctest/result/ will contain the HTML tables that show the results of your FIT acceptance tests. Eclipse allows you to quickly create test case classes and test suite classes to write your test code in. Fix the build path then try building this project The plugins are installed (with the WTP 2.0.1) and is displayed in the list of plugins through the Help>About Elcipse option. http://stackoverflow.com/questions/21165915/classnotfoundexception-junit-framework-testcase-cannot-be-found-by-org-eclipse

Join us to help others who have the same bug. The testForException() method demonstrates how to test that an exception is properly thrown. See my edits to the accepted answer. –Aaron Digulla Jan 30 '14 at 8:17 add a comment| up vote 2 down vote You may have have unresolved issues in your pom.xml

Many many thanks, your advice made me to check the whole project. Was there no tax before 1913 in the United States? In the left column select Java Build Path. Once the test case class is built the actual test cases are then coded in by the programmer.

hence there is nothing in the problems view. –Aaron Digulla Feb 17 '15 at 15:54 add a comment| up vote 0 down vote Two possible places to check for more details: This site uses cookies, as explained in our cookie policy. The default super class is junit.framework.TestCase. 2.2.2 Check which method stubs you would like to create. https://issues.jboss.org/browse/jbbuild-673 when a new Eclipse platform is started internally).

Trying to apply an update by going to Help > Software Updates > Find and Install and then selecting Search for updates of the currently installed features results in this error: When I run it, I get an error shown at the bottom of this posting. at org.codehaus.groovy.control.ResolveVisitor.visitClass(ResolveVisitor.java:1220) at org.codehaus.groovy.control.ResolveVisitor.startResolving(ResolveVisi tor.java:178)BUILD FAILED at org.codehaus.groovy.tools.javac.JavaAwareCompilationUnit$1.call(JavaAwareCompilationUnit.java:71) at org.codehaus.groovy.control.CompilationUnit.applyToPrimaryClassNodes( CompilationUnit.java:1055)Total time: 42.823 secs ... 19 moreCaused by: java.lang.ClassNotFoundException: junit.framework.TestCase at java.net.URLClassLoader$1.run(URLClassLoader.java:366) at java.net.URLClassLoader$1.run(URLClassLoader.java:355) at java.security.AccessController.doPrivileged(Native Method) at java.net.URLClassLoader.findClass(URLClar.java:354) at java.lang.ClassLoader.loadClass(ClassLoader.java:425) How small could an animal be before it is consciously aware of the effects of quantum mechanics?

David Newton Author Rancher Posts: 12617 I like... Am I missing something in the configuration of the build path? Open the problems view solve accordingly. Top | Contents 2.0 Creating a Test Class JUnit convention is that there is a test class created for every application class.

Note that you are using JUnit's old API, from before generics were introduced (Java 5). this content The junit class is very simple and could be run from anyone's PC: package com.bofa.news.upstream; import static org.junit.Assert.*; import java.util.ArrayList; import java.util.List; import org.junit.Before; import org.junit.Test; public class SimpleTest { List OR 1.2.1 Download junit.jar from here, or from www.junit.org. Deliverables to the TA List of bugs found in the CoffeeMaker Run all of your JUnit unit tests, which give a green bar.

Note: In order to switch between GERT and running JUnit tests, make sure that jcoverage.jar (located in the GERT plug-in directory) is on your project's build path. Top | Contents 5.0 Assertion Statement Reference This is a list of the different types of assertion statements that are used to test your code. Was there no tax before 1913 in the United States? http://mediastartpage.com/cannot-access/cannot-access-null-no-policy-files-granted-access.html Fix the build path then try building this project and: The project was not built since its build path is incomplete.

What did John Templeton mean when he said that the four most dangerous words in investing are: ‘this time it’s different'? Take a tour to get the most out of Samebug.

Tired of useless tips? I have tried opening the project using the -clean parameter as well as cleaning the project before and after the eclipse restart.

posted 6 years ago Glad to hear it worked--the WebLogic shop I worked at abandoned anything but Eclipse (and/or MyEclipse) many years ago; just wasn't worth the headache.

Automated exception search integrated into your IDE Test Samebug Integration for IntelliJ IDEA 0 mark Json-Schema-Validator in OSGI Environment Stack Overflow | 3 years ago | Sundar Ganesh java.lang.NoClassDefFoundError: com/fasterxml/jackson/core/JsonProcessingException find This is where you can chose which JUnit user interface to use. Is it possible to write division equation in more rows? Create a list of the bugs that you found.

BTW, please UseCodeTags when posting code or configuration. Atlassian JIRA Project Management Software (v7.2.3#72005-sha1:73be91d) About JIRA Report a problem Powered by a free Atlassian JIRA open source license for Red Hat, Inc.. These functions are: 1) Delete Inventory, 2) Check Inventory, and 3) Purchase Coffee. check over here Caused by: java.lang.ClassNotFoundException: junit.framework.TestCase cannot be found by org.eclipse.xtext.junit_2.4.3.v201309030823 at org.eclipse.osgi.internal.loader.BundleLoader.findClassInternal(BundleLoader.java:501) at org.eclipse.osgi.internal.loader.BundleLoader.findClass(BundleLoader.java:421) at org.eclipse.osgi.internal.loader.BundleLoader.findClass(BundleLoader.java:412) at org.eclipse.osgi.internal.baseadaptor.DefaultClassLoader.loadClass(DefaultClassLoader.java:107) at java.lang.ClassLoader.loadClass(ClassLoader.java:357) ... 78 more The exception happens when I run the tests for

If you agree to our use of cookies, please close this message and continue to use this site. Any help will be greatly appreciated. - Erik David Newton Author Rancher Posts: 12617 I like... Post Reply Bookmark Topic Watch Topic New Topic Similar Threads StrutsTestCase problem Tough Time Getting @Test(exception To Work GWTTestCase error -- The test class ... Why does Friedberg say that the role of the determinant is less central than in former times?

Usually all paths through each method in a class are tested in a unit test; however, you do not need to test getter and setter methods since they are trivial. 2.1 Running all of the test cases in the project will run those FIT tests and give you errors. Cannot find the class file for javax.servlet.http.HttpServletRequest. asked 5 years ago viewed 7513 times active 5 years ago Related 17Configuring ant to run unit tests.

Join them; it only takes a minute: Sign up ClassNotFoundException: junit.framework.TestCase cannot be found by org.eclipse.xtext.junit_2.4.3.v201309030823 up vote 10 down vote favorite 2 I'm puzzled by this error: java.lang.NoClassDefFoundError: junit/framework/TestCase at Browse other questions tagged eclipse ant junit classpath or ask your own question. You can see whether you have the same problem by looking at the stack trace: Does it contain RemotePluginTestRunner.main? While it is always a challenge and a tough decision to update the software to the latest and greatest when everyone else in the team is using an older version, I

share|improve this answer answered Nov 26 '10 at 11:52 jens 1,106821 OMG, I could weep. There are currently 5 (very obvious) bugs in the system. more stack exchange communities company blog Stack Exchange Inbox Reputation and Badges sign up log in tour help Tour Start here for a quick overview of the site Help Center Detailed

© Copyright 2017 mediastartpage.com. All rights reserved.